EM 12c: Enterprise Manager 12c Cloud Control OMS Installation on SUSE Linux 11 Fails with Message: Error in invoking target 'install' of makefile (Doc ID 1503554.1)

Last updated on DECEMBER 23, 2016

Applies to:

Enterprise Manager Base Platform - Version 12.1.0.1.0 and later
Linux x86-64

Symptoms

OMS install on Linux x86_64 (SuSE 11 described here) fails at the linking step:

From <CENTRAL_INVENTORY_HOME>/logs/installActions<timestamp>.log:

Error in invoking target 'install' of makefile '/opt/appl/oracle/mid_home/oms/sqlplus/lib/ins_sqlplus.mk'. See '/opt/appl/oraInventory/logs/installActions11-10-2012_08-35-15.log' for details.

Use Case 1

From <CENTRAL_INVENTORY_HOME>/logs/installActions<timestamp>.log:

cannot find -lclntsh
/oms/lib32/libztkg11.a(cc_memory.o): In function `krb5_mcc_generate_new':
cc_memory.c:(text.unlikely+0x1bd2): warning: the use of `mktemp' is dangerous, better use `mkstemp'
collect2: ld returned 1 exit status
make[1]: *** [/oms/sqlplus/bin/sqlplus32] Error 1
make[1]: Leaving directory `/oms/sqlplus/lib'
make: *** [newsqlplus32] Error 2

Use Case 2

From <CENTRAL_INVENTORY_HOME>/logs/installActions<timestamp>.log:

INFO: ../../x86_64-suse-linux/bin/ld: cannot find -lc
/usr/lib64/gcc/x86_64-suse-linux/4.3/../../../../x86_64-suse-linux/bin/ld: skipping incompatible /usr/lib64/gcc/x86_64-suse-linux/4.3/libgcc.a when searching for -lgcc
/usr/lib64/gcc/x86_64-suse-linux/4.3/../../../../x86_64-suse-linux/bin/ld: cannot find -lgcc
collect2: ld returned 1 exit status
make[1]: *** [<OMS_HOME>/sqlplus/bin/sqlplus32] Error 1
make: *** [newsqlplus32] Error 2

 

 

Changes

 

Cause

Sign In with your My Oracle Support account

Don't have a My Oracle Support account? Click to get started

My Oracle Support provides customers with access to over a
Million Knowledge Articles and hundreds of Community platforms