12c: Plugin deployment Fails At Prequisite Install Software "oracle.sysman.core.common.extensibility.deploy.StepException: Exit value of process oui/bin/setup.exe is non-zero: -1" (Doc ID 1589311.1)

Last updated on OCTOBER 07, 2013

Applies to:

Enterprise Manager Base Platform - Version 12.1.0.3.0 to 12.1.0.3.0 [Release 12.1]
Information in this document applies to any platform.

Symptoms

Deploying 12.1.0.3 SQL Server Plugin on 12.1.0.3 OMS fails at Pre-requisite check phase "Install Software"

configplugin_prereq_check_2013-09-19_10-31-38.trc


 

oracle.sysman.core.common.extensibility.pluginca.PluginCAException: EM-04002: Installation of the plug-in oracle.em.smss:12.1.0.3.0 on the Oracle home E:\weblogic\plugins\oracle.em.smss.oms.plugin_12.1.0.3.0 failed on the Management Server host <hostname>. Resolve the following issues, and retry:
E:\oraAgent\agent_inst\sysman\emd>"E:\weblogic\oms/oui/bin/setup.exe" -silent -waitforcompletion -clone -forceclone -defaulthomename -jreLoc E:\weblogic\jdk16\jdk\jre "dependeeHome=E:\weblogic\oms" "ORACLE_HOME=E:\weblogic\plugins\oracle.em.smss.oms.plugin_12.1.0.3.0" -noWait

at oracle.sysman.core.common.extensibility.pluginca.PluginCADriver.extractArchivesIfRequired(PluginCADriver.java:1683)
at oracle.sysman.core.common.extensibility.pluginca.PluginCADriver.initPluginCA(PluginCADriver.java:1938)
at oracle.sysman.core.common.extensibility.pluginca.PluginCADriver.beginConfig(PluginCADriver.java:1121)
at oracle.sysman.core.common.extensibility.pluginca.PluginCADriver.main(PluginCADriver.java:2376)
Caused by: oracle.sysman.core.common.extensibility.deploy.StepException: Exit value of process oui/bin/setup.exe is non-zero: -1
at oracle.sysman.core.common.extensibility.deploy.unzip.PluginUnzip.runInstaller(PluginUnzip.java:407)
at oracle.sysman.core.common.extensibility.deploy.unzip.PluginUnzip.installPlugin(PluginUnzip.java:223)
at oracle.sysman.core.common.extensibility.deploy.unzip.PluginUnzip.execute(PluginUnzip.java:213)
at oracle.sysman.core.common.extensibility.pluginca.PluginCADriver.extractArchivesIfRequired(PluginCADriver.java:1605)

 

Pre-requisite check Failed with the following error:

Checking swap space: 400 MB available, 500 MB required.    Failed <<<<



Cause

Sign In with your My Oracle Support account

Don't have a My Oracle Support account? Click to get started

My Oracle Support provides customers with access to over a
Million Knowledge Articles and hundreds of Community platforms