"BUILD FAILED" "org.codehaus.groovy.ant.Groovy cannot be found" Messaging Occurs During Opatch Execution (Doc ID 2257955.1)

Last updated on MAY 01, 2017

Applies to:

Hyperion Financial Management - Version 11.1.2.4.204 and later
Oracle Solaris on SPARC (64-bit)

Symptoms

Opatch process for applying Hyperion Financial Management Patch Set Update 25192566: 11.1.2.4.204 for the Oracle Solaris platform results in "BUILD FAILED" errors occurring during the 'Post-script processing' section of the process.  The output logging for the Opatch attempt reveals a more detailed explanation of why the Build Failed took place.  Here is an excerpt of the failed Post-script processing section:

 

[Apr 7, 2017 12:31:43 PM] --------------------- Post-script processing ---------------------
[Apr 7, 2017 12:31:43 PM] Start the Apply postScript at Fri Apr 07 12:31:43 CDT 2017
[Apr 7, 2017 12:31:43 PM] Execution of 'sh /u01/oracle/Middleware/EPMSystem11R1/OPatch/25192566/custom/scripts/post -apply 25192566 ':
[Apr 7, 2017 12:32:03 PM] Return Code = 1
[Apr 7, 2017 12:32:03 PM] Execution of ' Command and arguments of pre/post scripts is restricted to be viewed in log file ':
Cleaning mainwin files .....
Unzipping 3rd party binaries ....
Completed unzipping 3rd party binaries.
Giving execute permissions to /u01/oracle/Middleware/EPMSystem11R1/products/FinancialManagement/Server/hfm_post_install_steps.sh ...
Calling the post config script ....
Creating symlinks to the libboost files ....
Creating symlinks to the ODBC files ....
Creating symlink to the compression library ....
Giving base permissions to the all the files under [EOH]/products/FinancialManagement/ ...
Giving execute permissions to the shell scripts and executables in [EOH]/products/FinancialManagement/ ...
Correcting some other permissions in [EOH]/products/FinancialManagement/mw ...
Sourcing the mainwin runtime environment required for registration ...
Registering COM objects ....
RegSvr32: DllRegisterServer in /u01/oracle/Middleware/EPMSystem11R1/products/FinancialManagement/Server/libhfmcassecurity.so succeeded.
RegSvr32: DllRegisterServer in /u01/oracle/Middleware/EPMSystem11R1/products/FinancialManagement/Server/libhsxdssecurity.so succeeded.
RegSvr32: DllRegisterServer in /u01/oracle/Middleware/EPMSystem11R1/products/FinancialManagement/Server/libhsxsecurity.so succeeded.
RegSvr32: DllRegisterServer in /u01/oracle/Middleware/EPMSystem11R1/products/FinancialManagement/Server/libhsvsystemactivity.so succeeded.
RegSvr32: DllRegisterServer in /u01/oracle/Middleware/EPMSystem11R1/products/FinancialManagement/Server/libhsvsharedappdata.so succeeded.
RegSvr32: DllRegisterServer in /u01/oracle/Middleware/EPMSystem11R1/products/FinancialManagement/Server/libhsxsystemconfig.so succeeded.
RegSvr32: DllRegisterServer in /u01/oracle/Middleware/EPMSystem11R1/products/FinancialManagement/Server/libhsvscriptengine.so succeeded.
RegSvr32: DllRegisterServer in /u01/oracle/Middleware/EPMSystem11R1/products/FinancialManagement/Server/libhsvdsmemberlistscript.so succeeded.
RegSvr32: DllRegisterServer in /u01/oracle/Middleware/EPMSystem11R1/products/FinancialManagement/Server/libhsvdsrulesom.so succeeded.
Completed post install steps.
Buildfile: solaris_sparc_tasks.xml
Buildfile: copy_instance_files.xml

Return Code = 1
[Apr 7, 2017 12:32:03 PM] Command invocation returned Error... '
BUILD FAILED
/u01/oracle/Middleware/EPMSystem11R1/OPatch/25192566/custom/scripts/solaris_sparc_tasks.xml:14: taskdef class org.codehaus.groovy.ant.Groovy cannot be found

Total time: 0 seconds

BUILD FAILED
/u01/oracle/Middleware/EPMSystem11R1/OPatch/25192566/custom/scripts/copy_instance_files.xml:25: taskdef class org.codehaus.groovy.ant.Groovy cannot be found

Total time: 0 seconds
', Return Code = 1

Cause

Sign In with your My Oracle Support account

Don't have a My Oracle Support account? Click to get started

My Oracle Support provides customers with access to over a
Million Knowledge Articles and hundreds of Community platforms