My Oracle Support Banner

FDMEE ADF_FACES-60097 When Setting Up A Calculation Script Data Rule (Doc ID 2388026.1)

Last updated on APRIL 18, 2018

Applies to:

Hyperion Financial Data Quality Management, Enterprise Edition - Version 11.1.2.4.210 to 11.1.2.4.220 [Release 11.1]
Information in this document applies to any platform.

Symptoms

 When clicking the Calculation Script Parameter to add a parameter row, then click the magnifying glass to associate the runtime substitution variables from the script get the following pop up error
----------------------------------------------
java.lang.NoSuchMethodError:
com/essbase/api/datasource/IEssCube.getCalcFileRunTimeSubVars(Ljava/lang/String;)Lcom/essbase/api/base/IEssIterator;

ADF_FACES-60097:For more information, please see the server's error log for an entry beginning with:
ADF_FACES-60096:Server Exception during PPR, #17

---------------------------------------------

 

Reference from Aif-WebApp log

[ErpIntegrator0] [NOTIFICATION] [] [oracle.apps.erpi.model] [tid: 45] [userId: <anonymous>] [ecid: 0000MA7cC0V5aasEgjJ7CK1QkbD200000U,1:20065:257] [APP: AIF#11.1.2.0] [SRC_CLASS: com.hyperion.aif.gl.common.util.model.applicationModule.GLIntegrationBaseAMImpl] [SRC_METHOD: invoke_odi_process] pid:1670, Extract id:1970501, status:Session Failed :1970501 : ODI-1217: Session COMM_LOAD_BALANCES (1970501) fails with return code 7000.[[
ODI-1226: Step FAILED - Load Data fails after 1 attempt(s).
ODI-1232: Procedure COMM Finalize Process execution fails.
Caused By: org.apache.bsf.BSFException: exception from Jython:
Traceback (most recent call last):
File "<string>", line 10, in <module>
File "<string>", line 162, in finalizeProcess
RuntimeError: ODI-1226: Step COMM Load Data fails after 1 attempt(s).
ODI-1232: Procedure COMM Load Data execution fails.
Caused By: org.apache.bsf.BSFException: exception from Jython:
Traceback (most recent call last):
File "<string>", line 9, in <module>
File "<string>", line 4126, in loadData
File "<string>", line 1014, in callOdiServlet
File "__pyclasspath__/urllib2.py", line 124, in urlopen
File "__pyclasspath__/urllib2.py", line 387, in open
File "__pyclasspath__/urllib2.py", line 497, in http_response
File "__pyclasspath__/urllib2.py", line 425, in error
File "__pyclasspath__/urllib2.py", line 360, in _call_chain
File "__pyclasspath__/urllib2.py", line 506, in http_error_default
urllib2.HTTPError: HTTP Error 500: Internal Server Error

Cause

To view full details, sign in with your My Oracle Support account.

Don't have a My Oracle Support account? Click to get started!


My Oracle Support provides customers with access to over a million knowledge articles and a vibrant support community of peers and Oracle experts.