My Oracle Support Banner

E1: BSSV: Troubleshooting Consumer Sample Issues (P954001) with Business Services (BSSV) (Doc ID 1372646.1)

Last updated on APRIL 16, 2019

Applies to:

JD Edwards EnterpriseOne Tools - Version 8.97 and Prior and later
Information in this document applies to any platform.

Purpose

This document was created to assist customers on troubleshooting the different scenarios, causes and solutions for BSSV Consumer Sample (P954001) on WebLogic Server (WLS), Websphere (WAS) and Oracle Application Server (OAS).

Troubleshooting Steps

To view full details, sign in with your My Oracle Support account.

Don't have a My Oracle Support account? Click to get started!


In this Document
Purpose
Troubleshooting Steps
 How To
 How to install/configure the Consumer Sample (P954001) - Step by Step
 How to consume a Business Service deployed into the JDeveloper embedded OC4j or Integrated WebLogic Server - Local Testing
 How to debug a BSSV deployed to the local OC4J and executed via a C BSFN
 Errors and Solutions
 Call to Web Service failed, error: Invalid configuration for BSSS server. Please ensure that BSSV server configuration is completed.
 "BSSV Property Key JR010040_QUERY_MAX_ROWS is not found in the F951000"
 "There was a problem with the server while running the business function getAddressBookInfoByBSSVgetAddressBookInfoByBSSV."
 "Call to Web Service failed, error: java.lang.NullPointerException"
 "Tried all: 1 addresses, but could not connect over HTTPS to server: www.xxxxxxxxxxx.com port: 443 java.net.ConnectException: Tried all: 1 addresses, but could not connect over HTTPS to server: www.xxxxxxxx port: 443"
 "Exception occurred while validating role and/or environment in Java Connector Login method"
 "Oracle TNSNames file not loaded"
 No Errors, but nothing happens - No result back. - WebLogic 
 Unable to ping the Local BSSV server using "Configure Servers" application - WebLogic
 "java.lang.ArrayIndexOutOfBoundsException: Array index out of range: 0"  using BSSV on WebSphere
 Failure while running BSSV Consumer Test on WAS 6.1.0.27 
 Failure while running BSSV Consumer Test on WAS 7.0.0.11 or WAS 7.0.0.29.
 Exception caught in RI_WAS_ABWebServiceProcessor.getAddressBook.  Error is java.lang.NullPointerException
 "java.lang.IllegalArgumentException: Illegal group reference"
 P954001 displays the following error "Call to Web Service failed, error: javax.xml.ws.soap.SOAPFaultException: Internal Error"
 P954001 displays the following error "Error is com.sun.xml.ws.client.ClientTransportException: The server sent HTTP status code 404: Not Found."
 Generic "Call To web Service failed.." when testing P954001. Call Object Debug Log shows "JDENET Error = eInvalidRequest"
 Generic P954001 fails with " Error is javax.xml.ws.WebServiceException: java.net.SocketException: Connection reset." - WEB_SERVICE_CALL Corrective Action :Web Service Call Failed
 GOP Consumer Integration displays error: Call to Web Service failed, error: Failure to authenticate using the token provided in CallBusinessService message
 Consumer BSSV not working in multiple Environments set up in same path code
 "Ping Test Failed"  when pinging the BSSV server via P986110|ZJDE0003
 Run the Consumer Sample(P954001) and get Error "Connection closed, EOF detected  Warning "
References

My Oracle Support provides customers with access to over a million knowledge articles and a vibrant support community of peers and Oracle experts.