Upgrade fails with "org.w3c.dom.DOMException: NOT_FOUND_ERR" (Doc ID 1595053.1)

Last updated on NOVEMBER 03, 2016

Applies to:

Oracle WebCenter Sites - Version 11.1.1.6.0 and later
Information in this document applies to any platform.

Symptoms

Upgade of a delivery instance from 7.6.2 to 11.1.1.6.0 failed.

Install_log.log contains the following error

[2013-09-15 05:37:53.740][CS.INSTALL][INFO] CSSetupEngine.deployAction() deploying file /mnt/software/WCS_Sites_11.1.1.6.0/ContentServer/Sun/xsdlib/xsdlib.jar
[2013-09-15 05:37:53.741][CS.INSTALL][INFO] CSSetupEngine.deployAction() deploying file /mnt/software/WCS_Sites_11.1.1.6.0/ContentServer/sserve.jar
[2013-09-15 05:37:53.764][CS.INSTALL][ERROR] CSSetupEngine.deployAction() Exception Deploying
org.w3c.dom.DOMException: NOT_FOUND_ERR: An attempt is made to reference a node in a context where it does not exist.
  at com.sun.org.apache.xerces.internal.dom.ParentNode.internalInsertBefore(ParentNode.java:361)
  at com.sun.org.apache.xerces.internal.dom.ParentNode.insertBefore(ParentNode.java:284)
  at COM.FutureTense.Apps.Install.DocumentEditor.addMimeMapping(DocumentEditor.java:589)
  at COM.FutureTense.Apps.Install.J2EESetupEngine.generateWebXML(J2EESetupEngine.java:1971)
  at COM.FutureTense.Apps.Install.J2EESetupEngine.deployAction(J2EESetupEngine.java:339)
  at COM.FutureTense.Apps.Install.CSSetupEngine.doAction(CSSetupEngine.java:861)
  at COM.FutureTense.Apps.Install.InstallActionManager.doAction(InstallActionManager.java:425)
  at COM.FutureTense.Apps.Install.InstallActionManager.performCurrentAction(InstallActionManager.java:647)
  at COM.FutureTense.Apps.Install.ftInstallDialog$Worker.run(ftInstallDialog.java:1823)
[2013-09-15 05:37:53.801][CS.INSTALL][ERROR] Worker.run.
Install failed.
Please check log file.

Cause

Sign In with your My Oracle Support account

Don't have a My Oracle Support account? Click to get started

My Oracle Support provides customers with access to over a
Million Knowledge Articles and hundreds of Community platforms