My Oracle Support Banner

Unable To Start Up ESS Due To ESS-01172 Runtime Store Compatibility Check Failed Error (Doc ID 2485874.1)

Last updated on DECEMBER 31, 2019

Applies to:

Oracle SOA Suite - Version 12.2.1.3.0 and later
Information in this document applies to any platform.

Symptoms

On : 12.2.1.3.0 version, ESS Managed Server

Unable To Start Up ESS Due To  ESS-01172 Runtime Store Compatibility Check Failed Error

ERROR
-----------------------

<Dec 17, 2018 4:59:29,770 PM CST> <Error> <HTTP> <BEA-101216> <Servlet: "ESS mbean initializer" failed to preload on startup in Web application: "/ess-mbeans".
javax.management.MBeanException: ESS-07569 An error occurred while updating the Scheduler server configuration for server WLS_ESS1 in process group bsltso##WLS_ESS1.
    at oracle.as.scheduler.adapter.mbeans.EssConfigMXBeanImpl.createMBeanException(EssConfigMXBeanImpl.java:488)
    at oracle.as.scheduler.adapter.mbeans.EssConfigMXBeanImpl.createMBeanException(EssConfigMXBeanImpl.java:481)
    at oracle.as.scheduler.adapter.mbeans.EssConfigMXBeanImpl.initialize(EssConfigMXBeanImpl.java:355)
    at oracle.as.scheduler.adapter.mbeans.EssConfigMXBeanImpl.<init>(EssConfigMXBeanImpl.java:99)
    at oracle.as.scheduler.config.servlet.MBeanRegistrationServlet.initializeMBeans(MBeanRegistrationServlet.java:134)
    Truncated. see log file for complete stacktrace
Caused By: java.lang.Exception: ESS-01000 Failed to open runtime service. oracle.as.scheduler.runtime.RuntimeStoreCompatibilityException: ESS-01172 Runtime store compatibility check failed; mid-tier check version: 3.0.2.0_2.0, runtime store version: 3.0.0.12_0.2, schema name: SOA_ESS
    at oracle.as.scheduler.runtime.RuntimeStore.openInternal(RuntimeStore.java:228)
    at oracle.as.scheduler.adapter.mbeans.EssConfigMXBeanImpl.initialize(EssConfigMXBeanImpl.java:342)
    at oracle.as.scheduler.adapter.mbeans.EssConfigMXBeanImpl.<init>(EssConfigMXBeanImpl.java:99)
    at oracle.as.scheduler.config.servlet.MBeanRegistrationServlet.initializeMBeans(MBeanRegistrationServlet.java:134)
    at oracle.as.scheduler.config.servlet.MBeanRegistrationServlet.init(MBeanRegistrationServlet.java:113)
    Truncated. see log file for complete stacktrace
Caused By: java.lang.Exception:, runtime store version: 3.0.0.12_0.2, schema name: SOA_ESS
    at oracle.as.scheduler.runtime.jdbc.RtStoreImpl.openCommon(RtStoreImpl.java:884)
    at oracle.as.scheduler.runtime.jdbc.RtStoreImpl.openInternal(RtStoreImpl.java:750)
    at oracle.as.scheduler.runtime.RuntimeCoreImpl.openInternal(RuntimeCoreImpl.java:339)
    at oracle.as.scheduler.runtime.RuntimeImpl.openInternal(RuntimeImpl.java:540)
    at oracle.as.scheduler.runtime.RuntimeStore.openInternal(RuntimeStore.java:197)
    Truncated. see log file for complete stacktrace
Caused By: java.lang.Exception: ESS-01172 Runtime store compatibility check failed; mid-tier check version: 3.0.2.0_2.0, runtime store version: 3.0.0.12_0.2, schema name: SOA_ESS
    at oracle.as.scheduler.runtime.jdbc.RtsSchemaInfo.checkSchemaCompatibility(RtsSchemaInfo.java:194)
    at oracle.as.scheduler.runtime.jdbc.RtsSchemaInfo.checkRuntimeStoreCompatibility(RtsSchemaInfo.java:134)
    at oracle.as.scheduler.runtime.jdbc.RtStoreImpl.checkRuntimeStoreCompatibility(RtStoreImpl.java:3438)
    at oracle.as.scheduler.runtime.jdbc.RtStoreImpl.openCommon(RtStoreImpl.java:820)
    at oracle.as.scheduler.runtime.jdbc.RtStoreImpl.openInternal(RtStoreImpl.java:750)
    Truncated. see log file for complete stacktrace
>
<Dec 17, 2018 4:59:30,448 PM CST> <Error> <Deployer> <BEA-149231> <Unable to set the activation state to true for the application "ESSAPP".
weblogic.application.ModuleException: java.lang.Exception: ESS-01172 Runtime store compatibility check failed; mid-tier check version: 3.0.2.0_2.0, runtime store version: 3.0.0.12_0.2, schema name: SOA_ESS
    at weblogic.application.internal.ExtensibleModuleWrapper.start(ExtensibleModuleWrapper.java:140)
    at weblogic.application.internal.flow.ModuleListenerInvoker.start(ModuleListenerInvoker.java:124)
    at weblogic.application.internal.flow.ModuleStateDriver$3.next(ModuleStateDriver.java:233)
    at weblogic.application.internal.flow.ModuleStateDriver$3.next(ModuleStateDriver.java:228)
    at weblogic.application.utils.StateMachineDriver$ParallelChange.run(StateMachineDriver.java:83)
    Truncated. see log file for complete stacktrace
Caused By: java.lang.Exception: ESS-01172 Runtime store compatibility check failed; mid-tier check version: 3.0.2.0_2.0, runtime store version: 3.0.0.12_0.2, schema name: SOA_ESS
    at oracle.as.scheduler.runtime.jdbc.RtsSchemaInfo.checkSchemaCompatibility(RtsSchemaInfo.java:194)
    at oracle.as.scheduler.runtime.jdbc.RtsSchemaInfo.checkRuntimeStoreCompatibility(RtsSchemaInfo.java:134)
    at oracle.as.scheduler.runtime.jdbc.RtStoreImpl.checkRuntimeStoreCompatibility(RtStoreImpl.java:3438)
    at oracle.as.scheduler.runtime.jdbc.RtStoreImpl.openCommon(RtStoreImpl.java:820)
    at oracle.as.scheduler.runtime.jdbc.RtStoreImpl.openInternal(RtStoreImpl.java:750)
    Truncated. see log file for complete stacktrace
>
>

Cause

To view full details, sign in with your My Oracle Support account.

Don't have a My Oracle Support account? Click to get started!


In this Document
Symptoms
Cause
Solution
References


My Oracle Support provides customers with access to over a million knowledge articles and a vibrant support community of peers and Oracle experts.