CCB-NMS 12.1 Install / Deployment Fails (Doc ID 2221865.1)

Last updated on JANUARY 10, 2017

Applies to:

Oracle Utilities Customer Care and Billing Integration to Oracle Utilities Network Management - Version 12.1.0.0.0 and later
Information in this document applies to any platform.

Symptoms

CCB-NMS 12.1 install on SOA 12.1.3 is failing when deploying OUCCBOUNMSNotifyPreferenceEBF, with:

scac:
   [input] skipping input as property scac.input has already been set.
    [scac] Validating composite "/app/fmw/CCB-NMS/services/industry/Utilities/EBF/OUCCBOUNMSNotifyPreferenceEBF/composite.xml"
    [scac] Setting BPELC option 'classpath' to
    [scac] BPEL/OUCCBOUNMSNotifyPreferenceEBF.bpel:624: error: Namespace prefix "" qualifying "inputVariable.payload" cannot be resolved.
    [scac] BPEL/OUCCBOUNMSNotifyPreferenceEBF.bpel:733: error: Namespace prefix "" qualifying "inputVariable.payload" cannot be resolved.

BUILD FAILED
/app/fmw/CCB-NMS/bin/InstallBuild.xml:75: The following error occurred while executing this line:
/app/fmw/CCB-NMS/bin/InstallationDeployCompositeLibrary.xml:38: The following error occurred while executing this line:
/app/fmw/CCB-NMS/install/util/ant/InstallationCompositeLibrary.xml:396: The following error occurred while executing this line:
/app/fmw/CCB-NMS/install/util/ant/InstallationCompositeLibrary.xml:158: The following error occurred while executing this line:
/app/fmw/soa/bin/ant-sca-package.xml:51: The following error occurred while executing this line:
/app/fmw/soa/bin/ant-sca-compile.xml:342: Java returned: 1 Check log file : /tmp/out.err for errors

Cause

Sign In with your My Oracle Support account

Don't have a My Oracle Support account? Click to get started

My Oracle Support provides customers with access to over a
Million Knowledge Articles and hundreds of Community platforms