My Oracle Support Banner

"Relink of module "OFSBC" failed." and "Relink of module "OFSTP" failed." Error Applying R12 ADPATCH (Doc ID 2648194.1)

Last updated on MARCH 13, 2020

Applies to:

Oracle Financial Services Funds Transfer Pricing - Version 12.1.2 and later
Information in this document applies to any platform.

Symptoms

On 12.1.2, When attempting to run patch 28669292, the following error occurs:

ERROR

g++: /u01/appl/sht/12.0.0/lib/rwtools/libtls0s.a: No such file or directory
make: *** [/u01/appl/ftp/12.0.0/bin/OFSBC] Error 1
Done with link of ftp executable 'OFSBC' on Wed Mar 4 11:45:32 GMT 2020
 
Relink of module "OFSBC" failed.

g++: /u01/appl/sht/12.0.0/lib/rwtools/libtls0s.a: No such file or directory
make: *** [/u01/appl/ftp/12.0.0/bin/OFSTP] Error 1
Done with link of ftp executable 'OFSTP' on Wed Mar 4 11:45:32 GMT 2020
 
Relink of module "OFSTP" failed.

/u01/apps/10.1.2/lib/sysliblist` -ldl -lm -lpthread
g++: /u01/appl/sht/12.0.0/lib/rwtools/libtls0s.a: No such file or directory
make: *** [/u01/appl/ftp/12.0.0/bin/OFSBC] Error 1
Done with link of ftp executable 'OFSBC' on Wed Mar 4 12:53:13 GMT 2020
 
Relink of module "OFSBC" failed.

Starting link of ftp executable 'OFSTP' on Wed Mar 4 12:53:13 GMT 2020
make: Warning: File
`/u01/appl/admin/PREPROD/out/link_ftp_46999.mk' has modification time 2e+03 s in the future
g++ -m32 '-L/u01/appl/sht/12.0.0/lib/stubs'
-L/u01/apps/10.1.2/lib -L/u01/apps/10.1.2/lib/stubs -lclntsh
-o /u01/appl/ftp/12.0.0/bin/OFSTP \
/u01/appl/ftp/12.0.0/lib/ftpmain.o
/u01/appl/ftp/12.0.0/lib/libftp.a
/u01/appl/fem/12.0.0/lib/libfem.a \
/u01/appl/fnd/12.0.0/lib/libfnd.a
/u01/appl/eng/12.0.0/lib/libeng.a
/u01/appl/sht/12.0.0/lib/rwtools/libtls0s.a
/u01/appl/sht/12.0.0/lib/stubs/libstdc++.so
/u01/appl/sht/12.0.0/lib/stubs/libgcc_s.so.1 -lsql10 -lclntsh
`cat /u01/apps/10.1.2/lib/ldflags` -lnsslb10 -lncrypt10 -lnsgr10 -lnzjs10 -ln10 -lnnz10 -lnl10 -lnro10 `cat
/u01/apps/10.1.2/lib/ldflags` -lnsslb10 -lncrypt10 -lnsgr10
-lnzjs10 -ln10 -lnnz10 -lnl10 -lclient10 -lnnetd10 -lvsn10 -lcommon10
-lgeneric10 -lmm -lcore10 -lxml10 -lunls10 -lsnls10 -lnls10 -lcore10 -lnls10
`cat /u01/apps/10.1.2/lib/ldflags` -lnsslb10 -lncrypt10 -lnsgr10
-lnzjs10 -ln10 -lnnz10 -lnl10 -lnro10 `cat
/u01/apps/10.1.2/lib/ldflags` -lnsslb10 -lncrypt10 -lnsgr10
-lnzjs10 -ln10 -lnnz10 -lnl10 -lclient10 -lnnetd10 -lvsn10 -lcommon10
-lgeneric10 -lcore10 -lxml10 -lunls10 -lsnls10 -lnls10 -lcore10 -lnls10
-lclient10 -lnnetd10 -lvsn10 -lcommon10 -lgeneric10 -lcore10 -lxml10
-lunls10 -lsnls10 -lnls10 -lcore10 -lnls10 `cat
/u01/10.1.2/lib/sysliblist` -ldl -lm -lpthread
g++: /u01/appl/sht/12.0.0/lib/rwtools/libtls0s.a: No such file
or directory
make: *** [/u01/appl/ftp/12.0.0/bin/OFSTP] Error 1
Done with link of ftp executable 'OFSTP' on Wed Mar 4 12:53:14 GMT 2020
 
Relink of module "OFSTP" failed.
See error messages above (also recorded in log file) for possible
reasons for the failure. Also, please check that the Unix userid
running adrelink has read, write, and execute permissions
on the directory /u01/appl/ftp/12.0.0/bin, and that there is sufficient space remaining on the disk partition
containing your Oracle E-Business Suite installation.
 
Done with link of product 'ftp' on Wed Mar 4 12:53:14 GMT 2020

Cause

To view full details, sign in with your My Oracle Support account.

Don't have a My Oracle Support account? Click to get started!


In this Document
Symptoms
Cause
Solution


My Oracle Support provides customers with access to over a million knowledge articles and a vibrant support community of peers and Oracle experts.