My Oracle Support Banner

Developer Cloud Maven build deployment error of LifecycleExecutionException due to "Premature EOF encountered" in SOA Plugin (Doc ID 2578319.1)

Last updated on SEPTEMBER 03, 2019

Applies to:

Oracle Developer Cloud Service - Version 19.1.3 to 19.1.3
Information in this document applies to any platform.

Symptoms

Tried to deployment application with SOA compound in Developer Cloud, but the build failed with the following error:

[DEBUG] Setting http.nonProxyHosts=localhost,127.0.0.1,*.developer.xxx.oraclecloud.com,developer.xxx.oraclecloud.com,xxx.oraclecloud.com,xxx.cloud.oracle.com,xxx.oraclecloud.com,xxx.oracleoutsourcing.com,xxx,.developer.xxx.oraclecloud.com
Processing sar=/home/builder/hudson/workspace/xxx.xxx1.0-SNAPSHOT.jar
...

[INFO] ------------------------------------------------------------------------
[INFO] BUILD FAILURE
[INFO] ------------------------------------------------------------------------
[INFO] Total time: 05:26 min
[INFO] Finished at: 2019-08-14T23:36:47+00:00
[INFO] Final Memory: 21M/112M
[INFO] ------------------------------------------------------------------------
[INFO] o.h.m.e.h.MavenExecutionResultHandler - Build failed with exception(s)
[INFO] o.h.m.e.h.MavenExecutionResultHandler - [1] org.apache.maven.lifecycle.LifecycleExecutionException: Failed to execute goal com.oracle.soa.plugin:oracle-soa-plugin:12.2.1-3-0:deploy (default-deploy) on project Dat_SynchronizeCeveFTPConnectionInfo: Premature EOF encountered
[DEBUG] Closing connection to remote
[ERROR] Failed to execute goal com.oracle.soa.plugin:oracle-soa-plugin:12.2.1-3-0:deploy (default-deploy) on project Dat_SynchronizeCeveFTPConnectionInfo: Premature EOF encountered -> [Help 1]
org.apache.maven.lifecycle.LifecycleExecutionException: Failed to execute goal com.oracle.soa.plugin:oracle-soa-plugin:12.2.1-3-0:deploy (default-deploy) on project Dat_SynchronizeCeveFTPConnectionInfo: Premature EOF encountered
at org.apache.maven.lifecycle.internal.MojoExecutor.execute(MojoExecutor.java:216)
at org.apache.maven.lifecycle.internal.MojoExecutor.execute(MojoExecutor.java:153)
at org.apache.maven.lifecycle.internal.MojoExecutor.execute(MojoExecutor.java:145)
at org.apache.maven.lifecycle.internal.LifecycleModuleBuilder.buildProject(LifecycleModuleBuilder.java:116)
at org.apache.maven.lifecycle.internal.LifecycleModuleBuilder.buildProject(LifecycleModuleBuilder.java:80)
at org.apache.maven.lifecycle.internal.builder.singlethreaded.SingleThreadedBuilder.build(SingleThreadedBuilder.java:51)
at org.apache.maven.lifecycle.internal.LifecycleStarter.execute(LifecycleStarter.java:128)
at org.apache.maven.DefaultMaven.doExecute(DefaultMaven.java:307)
at org.apache.maven.DefaultMaven.doExecute(DefaultMaven.java:193)
at org.apache.maven.DefaultMaven.execute(DefaultMaven.java:106)
at org.apache.maven.cli.MavenCli.execute(MavenCli.java:862)
at org.apache.maven.cli.MavenCli.doMain(MavenCli.java:286)
at org.apache.maven.cli.MavenCli.main(MavenCli.java:197)
at sun.reflect.NativeMethodAccessorImpl.invoke0(Native Method)
at sun.reflect.NativeMethodAccessorImpl.invoke(NativeMethodAccessorImpl.java:62)
at sun.reflect.DelegatingMethodAccessorImpl.invoke(DelegatingMethodAccessorImpl.java:43)
at java.lang.reflect.Method.invoke(Method.java:498)
at org.codehaus.plexus.classworlds.launcher.Launcher.launchEnhanced(Launcher.java:289)
at org.codehaus.plexus.classworlds.launcher.Launcher.launch(Launcher.java:229)
at org.codehaus.plexus.classworlds.launcher.Launcher.mainWithExitCode(Launcher.java:415)
at org.codehaus.plexus.classworlds.launcher.Launcher.main(Launcher.java:356)
Caused by: org.apache.maven.plugin.MojoExecutionException: Premature EOF encountered
at com.oracle.soa.plugin.AbstractDeploymentHandlerMojo.execute(AbstractDeploymentHandlerMojo.java:118)
at org.apache.maven.plugin.DefaultBuildPluginManager.executeMojo(DefaultBuildPluginManager.java:134)
at org.apache.maven.lifecycle.internal.MojoExecutor.execute(MojoExecutor.java:208)
... 20 more
Caused by: java.io.EOFException: Premature EOF encountered
at HTTPClient.StreamDemultiplexor.read(StreamDemultiplexor.java:363)
at HTTPClient.RespInputStream.read(RespInputStream.java:151)
at HTTPClient.RespInputStream.read(RespInputStream.java:112)
at HTTPClient.Response.readResponseHeaders(Response.java:1170)
at HTTPClient.Response.getHeaders(Response.java:893)
at HTTPClient.Response.getStatusCode(Response.java:341)
at HTTPClient.RetryModule.responsePhase1Handler(RetryModule.java:94)
at HTTPClient.HTTPResponse.handleResponseImpl(HTTPResponse.java:888)
at HTTPClient.HTTPResponse.access$000(HTTPResponse.java:64)
at HTTPClient.HTTPResponse$2.run(HTTPResponse.java:855)
at HTTPClient.HTTPResponse$2.run(HTTPResponse.java:853)
at HTTPClient.HttpClientConfiguration.doAction(HttpClientConfiguration.java:1083)
at HTTPClient.HTTPResponse.handleResponse(HTTPResponse.java:853)
at HTTPClient.HTTPResponse.getStatusCode(HTTPResponse.java:246)
at oracle.integration.platform.blocks.deploy.servlet.client.DeployerHttpClient.sendRequest(DeployerHttpClient.java:464)
at oracle.integration.platform.blocks.deploy.servlet.CompositeServletClientBase.sendRequest(CompositeServletClientBase.java:400)
at com.oracle.soa.plugin.AbstractDeploymentHandlerMojo.performRequest(AbstractDeploymentHandlerMojo.java:136)
at com.oracle.soa.plugin.AbstractDeploymentHandlerMojo.execute(AbstractDeploymentHandlerMojo.java:116)
... 22 more
[ERROR]
[ERROR]
[ERROR] For more information about the errors and possible solutions, please read the following articles:
[ERROR] [Help 1] http://cwiki.apache.org/confluence/display/MAVEN/MojoExecutionException
[DEBUG] Waiting for process to finish
[DEBUG] Result: 1
Finished: FAILURE

 

 

Cause

To view full details, sign in with your My Oracle Support account.

Don't have a My Oracle Support account? Click to get started!


In this Document
Symptoms
Cause
Solution


My Oracle Support provides customers with access to over a million knowledge articles and a vibrant support community of peers and Oracle experts.