SES Shows No Attributes During Integration With UCM and Throws Error, "No security attribute defined for source"

(Doc ID 749795.1)

Last updated on FEBRUARY 05, 2018

Applies to:

Oracle WebCenter Content - Version to [Release 10gR3]
Oracle Secure Enterprise Search - Version and later
Information in this document applies to any platform.


When trying to integrate the SES with UCM and it is throwing the following error:

Error on SES side:

10:26:50:562 ERROR main EQG-31209: No security attribute defined for source (id=85)
at ImtCrawler.main(

10:26:50:562 ERROR main EQG-30249: Crawler process aborted

Error on UCM side:


Login to UCM portal--> Operation Management ---->SES Crawler Export--> Take snapshot

Error message as follows:
Aborted:Content export already in progress

Log files shows the following error:

Error 6/10/08 11:30 AM Indexing aborted. Unable to create directory '/datafeeds'. [ Details ]
An error has occurred. The stack trace below shows more information.

intradoc.common.ServiceException: !syFileUtilsUnableToCreateSpecifiedDir,/datafeeds
at intradoc.common.FileUtils.checkOrCreateDirectoryPrepareForLocks(
Error 6/10/08 11:33 AM Event generated by user 'sysadmin' at host ''. intradoc.common.ServiceException: badness - todo [ Details ]
An error has occurred. The stack trace below shows more information.

!csUserEventMessage,sysadmin,!$!syExceptionType2,intradoc.common.ServiceException,badness - todo
intradoc.common.ServiceException: badness - todo
at sescrawlerexport.SESCrawlerExportErrorFeed.write(


Sign In with your My Oracle Support account

Don't have a My Oracle Support account? Click to get started

My Oracle Support provides customers with access to over a
Million Knowledge Articles and hundreds of Community platforms