R11i: AR: Patch Error: After Applying 9276325 (SEPA Direct Debit Project) AR Fails Relinking AR.dll On Windows Platform (Doc ID 1246444.1)

Last updated on MARCH 30, 2016

Applies to:

Oracle Receivables - Version 11.5.10.2 to 11.5.10.3 [Release 11.5.10]
Information in this document applies to any platform.
Checked for relevance on 13-May-2013

Symptoms

On : 11.5.10.2 version, Installation Issues

When attempting to install <Patch 9276325> AR UPTAKE OF SEPA DIRECT DEBIT PROJECT, the following error occurs:

gnumake -f d:/oracle/ebsdevappl/admin/EBSDEV/out/link_ar_4876.mk
d:/oracle/ebsdevappl/ar/11.5.0/bin/AR.dll

Starting link of ar executable 'AR.dll' on Fri Oct 15 15:33:57 RDT 2010
link.exe -MAP:d:/oracle/ebsdevappl/ar/11.5.0/bin/AR.map -NODEFAULTLIB
-MACHINE:IX86 -NOLOGO -SUBSYSTEM:CONSOLE -PDB:NONE -DLL
-OUT:d:/oracle/ebsdevappl/ar/11.5.0/bin/AR.dll \
d:/oracle/ebsdevappl/ar/11.5.0/lib/ARST.lib
d:/oracle/ebsdevappl/ar/11.5.0/lib/AR.exp \
d:/oracle/ebsdevappl/fnd/11.5.0/lib/FNDCORE.lib
d:/oracle/ebsdevora/8.0.6/PRO80/lib/msvc/sqllib80.lib
d:/oracle/ebsdevora/8.0.6/PRO80/lib/msvc/sqxlib80.lib
d:/oracle/ebsdevora/8.0.6/lib/ora805.lib
d:/oracle/ebsdevora/8.0.6/otrace80/lib/otrace80.lib
d:/oracle/ebsdevora/8.0.6/lib/nl80.lib d:/oracle/ebsdevora/8.0.6/lib/nt80.lib
d:/oracle/ebsdevora/8.0.6/lib/ns80.lib d:/oracle/ebsdevora/8.0.6/lib/ni80.lib
d:/oracle/ebsdevora/8.0.6/lib/ncr80.lib
d:/oracle/ebsdevora/8.0.6/lib/nnfg80.lib
d:/oracle/ebsdevora/8.0.6/lib/nlsrtl33.lib
d:/oracle/ebsdevora/8.0.6/lib/core40.lib C:/VC98/LIB/MSVCRT.LIB
C:/VC98/LIB/OLDNAMES.LIB C:/VC98/LIB/KERNEL32.LIB C:/VC98/LIB/USER32.LIB
C:/VC98/LIB/ADVAPI32.LIB C:/VC98/LIB/WINSPOOL.LIB C:/VC98/LIB/COMDLG32.LIB
C:/VC98/LIB/GDI32.LIB C:/VC98/LIB/VERSION.LIB
ARST.lib(arxsga.obj) : error LNK2005: _set_debug already defined in
ARST.lib(ardlgm.obj)
d:/oracle/ebsdevappl/ar/11.5.0/bin/AR.dll : fatal error LNK1169: one or more
multiply defined symbols found
gnumake: *** [d:/oracle/ebsdevappl/ar/11.5.0/bin/AR.dll] Error 1169
Done with link of ar executable 'AR.dll' on Fri Oct 15 15:33:57 RDT 2010


Relink of module "AR.dll" failed.
See error messages above (also recorded in log file) for possible
reasons for the failure. Also, please check that the Unix userid
running adrelink has read, write, and execute permissions
on the directory d:/oracle/ebsdevappl/ar/11.5.0/bin,
and that there is sufficient space remaining on the disk partition
containing your Oracle Applications installation.

Cause

Sign In with your My Oracle Support account

Don't have a My Oracle Support account? Click to get started

My Oracle Support provides customers with access to over a
Million Knowledge Articles and hundreds of Community platforms