My Oracle Support Banner Fails With Relink Error "collect2: error: ld returned 1 exit status" (Doc ID 2390086.1)

Last updated on DECEMBER 03, 2019

Applies to:

Oracle Applications Manager - Version 12.1.1 and later
Information in this document applies to any platform.


Rapidclone fails with the following error:

/usr/bin/ld: cannot find -lclntsh
collect2: error: ld returned 1 exit status
make: *** [sqlplus] Error 1
Failed linking target sqlplus on Wed Apr 18 17:37:53 PDT 2018...

Error found while relinking
  return code = .9

Additionally, forms will fail with the following error:

Forms session aborted: unable to communicate with runtime process. formsweb: Forms session exception stack FRM-93000: Unexpected internal error.Details : No HTTP headers received from runform

/bin/ld: final link failed: Bad value
collect2: error: ld returned 1 exit status
/usr/bin/ld: cannot find -lclntsh
collect2: error: ld returned 1 exit status

Steps to reproduce the issue:
The issue can be reproduced at will with the following steps:
1. Clone the instance using rapidclone.
2. Try to access the forms and they fail.




To view full details, sign in with your My Oracle Support account.

Don't have a My Oracle Support account? Click to get started!

In this Document

My Oracle Support provides customers with access to over a million knowledge articles and a vibrant support community of peers and Oracle experts.