My Oracle Support Banner

Turkey Localization: Patch 24792554 failed with error "FAILED: file XLIFFLoader.class" (Doc ID 2542002.1)

Last updated on SEPTEMBER 09, 2019

Applies to:

EMEA Add-on Localizations - Version 12.2.6 and later
Information in this document applies to any platform.


Reported Issue
When applying patch 24792554 TR NLS , it is failing with an error. 

Error mesage
FAILED: file XLIFFLoader.class on worker 1.
FAILED: file XLIFFLoader.class on worker 2.
FAILED: file XLIFFLoader.class on worker 3.
FAILED: file XLIFFLoader.class on worker 4.

See the following error:
[EVENT] Log:
[PROCEDURE] Running: adpatch workers=16 console=no interactive=no
driver=u24792554.drv logfile=u24792554.log acp=yes
[UNEXPECTED]Error occurred executing "adpatch workers=16 console=no interactive=no
driver=u24792554.drv logfile=u24792554.log"
[UNEXPECTED]Refer to the log files for more information.
[STATEMENT] SQL Statment : " update ad_adop_session_patches
set status='F'
where adop_session_id=7 and status='R' and node_name='akkokr12tstapp'
[UNEXPECTED]Apply phase has failed.
[PROCEDURE] [START 2017/10/16 11:31:53] Updating adop session status
[STATEMENT] SQL statement : " update ad_adop_sessions
set status='F'
where adop_session_id = 7 and appltop_id = 212 and node_name='akkokr12tstapp'


Expected Behavior
Expect that the patch should be allowed for application without any error.



To view full details, sign in with your My Oracle Support account.

Don't have a My Oracle Support account? Click to get started!

In this Document

My Oracle Support provides customers with access to over a million knowledge articles and a vibrant support community of peers and Oracle experts.