Installing R12.0.4 Ebuisines Suite Autoconfig Fails With: sqlplus: error while loading shared libraries: libclntsh.so.10.1: cannot open shared object file: No such file or directory (Doc ID 579254.1)

Last updated on JANUARY 26, 2017

Applies to:

Oracle Applications Manager - Version 12.0.6 to 12.0.6 [Release 12]
Oracle Applications Technology Stack - Version 12.0.6 to 12.0.6 [Release 12.0]
Oracle Applications DBA - Version 12.0.6 to 12.0.6 [Release 12]
Linux x86
Red Hat Enterprise Linux Advanced Server x86-64 (AMD Opteron Architecture)
***Checked for relevance on 14-Feb-2013***
***Checked for Relevance on 26-JAN-2017***

Symptoms

When attempting to install E-Business Suite 12.0.4,the following error occurs:

ERROR:

[SETUP PHASE]
AutoConfig could not successfully execute the following scripts:
Directory: /oracle/DEV/inst/apps/CONTEXT_NAME/admin/install
adgendbc.sh INSTE8_SETUP 1
adgenjky.sh INSTE8_SETUP 1
afcpnode.sh INSTE8_SETUP 127
afgcsreg.sh INSTE8_SETUP 127

[PROFILE PHASE]
AutoConfig could not successfully execute the following scripts:
Directory: <base_install>/apps/tech_st/10.1.3/perl/bin/perl -I
<base_install>/apps/tech_st/10.1.3/perl/lib/5.8.3 -I
<base_install>/apps/tech_st/10.1.3/perl/lib/site_perl/5.8.3 -I
<base_install>/apps/apps_st/appl/au/12.0.0/perl -I
<base_install>/apps/tech_st/10.1.3/Apache/Apache/mod_perl/lib/site_perl/5.8.3/i686-linux-thread-multi
<base_install>/inst/apps/CONTEXT_NAME/admin/scripts/adexecsql.pl
sqlfile<base_install>/inst/apps/CONTEXT_NAME/admin/install
afwebprf.sql INSTE8_PRF 32512
amscmprf.sql INSTE8_PRF 32512
amswebprf.sql INSTE8_PRF 32512
bisadmprf.sql INSTE8_PRF 32512
bisdblrp.sql INSTE8_PRF 32512
clnadmprf.sql INSTE8_PRF 32512
cnadmprf.sql INSTE8_PRF 32512
cncmprf.sql INSTE8_PRF 32512
cseadmprf.sql INSTE8_PRF 32512
csfadmprf.sql INSTE8_PRF 32512
csiadmprf.sql INSTE8_PRF 32512
eamadmprf.sql INSTE8_PRF 32512
fteadmprf.sql INSTE8_PRF 32512
ibywebprf.sql INSTE8_PRF 32512
icxwebprf.sql INSTE8_PRF 32512
oksfrmprf.sql INSTE8_PRF 32512
wshadmprf.sql INSTE8_PRF 32512

Directory: <base_install>/inst/apps/CONTEXT_NAME/admin/install
adadmprf.sh INSTE8_PRF 127
afadmprf.sh INSTE8_PRF 127
afcpctx.sh INSTE8_PRF 127
afcpgsm.sh INSTE8_PRF 127
igccmprf.sh INSTE8_PRF 127
jtfictx.sh INSTE8_PRF 127
mwamscasvc.sh INSTE8_PRF 127
okladmprf.sh INSTE8_PRF 127
txkJavaMailerCfg.sh INSTE8_PRF 127
txkWebServicescfg.sh INSTE8_PRF 127

[APPLY PHASE]
AutoConfig could not successfully execute the following scripts:
Directory: <base_install>/apps/tech_st/10.1.3/perl/bin/perl -I
<base_install>/apps/tech_st/10.1.3/perl/lib/5.8.3 -I
<base_install>/apps/tech_st/10.1.3/perl/lib/site_perl/5.8.3 -I
<base_install>/apps/apps_st/appl/au/12.0.0/perl -I
<base_install>/apps/tech_st/10.1.3/Apache/Apache/mod_perl/lib/site_perl/5.8.3/i686-linux-thread-multi
<base_install>/inst/apps/CONTEXT_NAME/admin/install
adadmat.pl INSTE8_APPLY 32512


AutoConfig is exiting with status 32



All scripts fails with:

sqlplus: error while loading shared libraries: libclntsh.so.10.1: cannot open shared object file:
No such file or directory

In make_<MMDDHHMM>.log next error is displayed:

<base_install>/apps/tech_st/10.1.2/bin/ogcc -o /oracle/<SID>/apps/tech_st/10.1.2/lib//librwu.so
-shared -L<base_install>/apps/tech_st/10.1.2/lib/ -L<base_install>/apps/tech_st/10.1.2/lib/stubs/
rwsutil.o rwspid.o \
-lm <base_install>/apps/tech_st/10.1.2/lib/libclntsh.so -lpthread -Wl,-rpath,/usr/X11R6/lib
-L/usr/X11R6/lib -lXm -lXt -lX11 -lm -lXp -lXext `cat
<base_install>/apps/tech_st/10.1.2/lib/sysliblist` -lc )
which: no gcc in
(/usr/ccs/bin:<base_install>/apps/tech_st/10.1.2/bin:/usr/bin:/usr/bin:/oracle/StageR12/startCD/Disk 1/rapidwiz/unzip/Linux_x64:/usr/bin:/usr/kerberos/sbin:/usr/kerberos/bin:/usr/local/sbin:/usr/local/
bin:/sbin:/bin:/usr/sbin:/usr/bin:/usr/X11R6/bin:/root/bin)
Usage: file [-bcikLnNsvz] [-f namefile] [-F separator] [-m magicfiles] file...
file -C -m magicfiles
Try `file --help' for more information.
<base_install>/apps/tech_st/10.1.2/bin/ogcc: line 31: gcc: command not found
make: *** [<base_install>/apps/tech_st/10.1.2/lib//librwu.so] Error 127
Failed linking target libso_install on date...

 

Cause

Sign In with your My Oracle Support account

Don't have a My Oracle Support account? Click to get started

My Oracle Support provides customers with access to over a
Million Knowledge Articles and hundreds of Community platforms