Possible HTTP Errors During Fusion Applications Provisioning In Validation Phase (Doc ID 1404577.1)

Last updated on DECEMBER 16, 2014

Applies to:

Oracle Fusion Application Toolkit - Version 11.1.2.0.0 to 11.1.6.0.0 [Release 1.0]
Information in this document applies to any platform.

Symptoms

Provisioning Fusion Applications may encounter with any of the following errors during the validation phase:

Error 1: 
The HTTP request to http://<host>:<port>/access/oblix/apps/webgate/bin/webgate.cgi?progid=1 returned status: 200.

Error 2:
Following errors occured while validating datasources on target ProcurementCluster: [Validation of datasource BIAnalyticsServer failed: Connection test failed with the following exception: java.lang.NullPointerException]

Error 3:
The HTTP request to http://<host>:<port>/analytics/saw.dll?bieehome&startPage=1 returned status: 302.

Error 4:
Failed connecting to http://<host>:<port>/analytics, sun.security.validator.ValidatorException: PKIX path building failed: sun.security.provider.certpath.SunCertPathBuilderException: unable to find valid certification path to requested target

Error 5:
The HTTP request to http://<host>:<port>/calcmgr/ returned status: 500.

Error 6:
The HTTP request to http://<host>:<port>/calcmgr/ returned status: 302.

Error 7:
Failed connecting to http://<host>:<port>/calcmgr, sun.security.validator.ValidatorException: PKIX path building failed: sun.security.provider.certpath.SunCertPathBuilderException: unable to find valid certification path to requested target

Error 8:
Validation Phase failed with 404 Error on WebGate

Error 9:
Validate Phase Failed with Server Returned HTTP Response Code: 403 for URL

 

Changes

New Installation

Cause

Sign In with your My Oracle Support account

Don't have a My Oracle Support account? Click to get started

My Oracle Support provides customers with access to over a
Million Knowledge Articles and hundreds of Community platforms