FA 11.1.8 Provisioning Validation error: LDAP: error code 32 - LDAP Error 32 : No Such Object

(Doc ID 1919994.1)

Last updated on SEPTEMBER 09, 2016

Applies to:

Oracle Fusion Applications Common Components - Version 11.1.8.0.0 and later
Information in this document applies to any platform.

Symptoms

During Fusion Application 11.1.8 Provisioning Validation phase the following errors occur:

ERROR
-----------------------
2014-07-26 18:26:06.371 NOTIFICATION [echo] Validating file OID_OKC_CONTRACTS.ldif identities to OID...
2014-07-26 18:26:07.629 NOTIFICATION [logStatus] STATE=BUILD_ERROR!TIMESTAMP=2014-07-26 18:26:07 CDT!TARGET=common-validate-global-identities!CATEGORY=BUILD_ERROR!DOMAIN=CommonDomain!HOSTNAME=<hostname>.com!PRODUCTFAMILY=fs!PRODUCT=Functional-Setup!TASK=validateLDIFEntries!TASKID=fs.Functional-Setup.BUILD_ERROR.common-validate-global-identities.validateLDIFEntries!MESSAGE=ldapSearch encountered an error while validating the group 'cn=OKC_CUSTOMER_CONTRACT_TEAM_MEMBER_ABSTRACT,cn=FusionGroups,cn=Groups,dc=xxx,dc=xxx,dc=com' [LDAP: error code 32 - LDAP Error 32 : No Such Object] url - ldap://<hostname>:6501!DETAIL=ldapSearch encountered an error while validating the group 'cn=OKC_CUSTOMER_CONTRACT_TEAM_MEMBER_ABSTRACT,cn=FusionGroups,cn=Groups,dc=xxx,dc=xxx,dc=com' [LDAP: error code 32 - LDAP Error 32 : No Such Object] url - ldap://<hostname>:6501!BUILDFILE=/cdfarm/Staging/FIN/CFG_provfwk11.1.8/provisioning/provisioning-build/common-validate-build.xml!LINENUMBER=1010!


STEPS TO REPRODUCE
-----------------------
The issue can be reproduced at will with the following steps:
1 Run provisioning prevalidation
2. Run validation
3. Check the validation log files

Cause

Sign In with your My Oracle Support account

Don't have a My Oracle Support account? Click to get started

My Oracle Support provides customers with access to over a
Million Knowledge Articles and hundreds of Community platforms