R12 E-Business Suite Applications Manager Rapid Install Process Fails On Linux With Error 'RW-50010 script has returned an error RW-50004 running external process' or 'Fatal Error: TXK Install Service: oracle.apps.fnd.txk.config.ProcessStateException'

(Doc ID 2393903.1)

Last updated on MAY 08, 2018

Applies to:

Oracle Applications Manager - Version 12.1.3 to 12.2 [Release 12.1 to 12.2Cloud]
Information in this document applies to any platform.

Symptoms

E-Business Suite R12 Applications Manager, Applications Install related issues

 

 

 



E-Business Suite Rapidwiz rapid install fails with the following errors:

Cannot install Oracle Database Home patches

Cannot patch 10.1.2 Tools.

 RW-50010: Error: - script has returned an error: 1
RW-50004: Error code received when running external process. Check log file for details.
Running Database Install Driver for <instance_name> instance

or

Fatal Error: TXK Install Service: oracle.apps.fnd.txk.config.ProcessStateException: FileSys OS COMMAND Failed : Exit=2

oracle.apps.fnd.txk.config.ProcessStateException: FileSys OS COMMAND Failed : Exit=2 See log for details. CMD= make -f ins_forms.mk sharedlib install

 

The full Rapidwiz error is included below:

Fatal Error: TXK Install Service

oracle.apps.fnd.txk.config.ProcessStateException: FileSys OS COMMAND Failed : Exit=2 See log for details. CMD= make -f ins_forms.mk sharedlib install ## Node=NodeId=1105 Type=24 TypeName=filesys_patch_action Name= RefId=457 State=init ConfigDoc=APPS_C_HOME ParentDoc=null Topology=R12 Action=os_cmd

at oracle.apps.fnd.txk.config.FileSysPatchActionNode.doFileSysOSCmd(FileSysPatchActionNode.java:169)

at oracle.apps.fnd.txk.config.FileSysPatchActionNode.processState(FileSysPatchActionNode.java:101)

at oracle.apps.fnd.txk.config.PatchActionNode.processState(PatchActionNode.java:187)

at oracle.apps.fnd.txk.config.PatchNode.processState(PatchNode.java:338)

at oracle.apps.fnd.txk.config.PatchesNode.processState(PatchesNode.java:79)

at oracle.apps.fnd.txk.config.InstallNode.processState(InstallNode.java:68)

at oracle.apps.fnd.txk.config.TXKTopology.traverse(TXKTopology.java:594)

at oracle.apps.fnd.txk.config.InstallService.doInvoke(InstallService.java:224)

at oracle.apps.fnd.txk.config.InstallService.invoke(InstallService.java:237)

at oracle.apps.fnd.txk.config.InstallService.main(InstallService.java:291)

and in make_04190749.log We can see the following relink issue:

bin/ld: fs2/EBSapps/10.1.2/lib/libclient10.a(kpm.o): direct GOT relocation R_386_GOT32 against '__PGOSF224_kpmhalloc' without base register can not be used when making a shared object
/bin/ld: final link failed: Bad value
collect2: error: ld returned 1 exit status

/fs2/EBSapps/10.1.2/lib/sysliblist' -Wl,-rpath,/fs2/EBSapps/10.1.2/lib -lm 'cat /fs2/EBSapps/10.1.2/lib/sysliblist' -ldl -lm -L/fs2/EBSapps/10.1.2/lib -L/u01/oracle/DEV/fs2/EBSapps/10.1.2/lib/stubs/
/usr/bin/ld: cannot find -lclntsh
collect2: error: ld returned 1 exit status
make: *** [/fs2/EBSapps/10.1.2/rdbms/lib/imp] Error 1
Failed linking target iimp on Thu Apr 19 07:49:53 SAST 2018...
/fs2/EBSapps/10.1.2/rdbms/lib

Completed linking targets sharedlibs on Thu Apr 19 07:49:53 SAST 2018...

Error found while relinking
return code = .10.11.13.14.15.16.33.36.37.39.43.44.45.46.46.47.48.49

Cannot patch 10.1.2 Tools.

RW-50010: Error: - script has returned an error: 1
RW-50004: Error code received when running external process. Check log file for details.
Running APPL_TOP Install Driver for <instance> instance

The issue can be reproduced at will with the following steps:
1. build the stage
2. run rapidwiz

The issue has the following business impact:
Due to this issue, users cannot complete the install.

Cause

Sign In with your My Oracle Support account

Don't have a My Oracle Support account? Click to get started

My Oracle Support provides customers with access to over a
Million Knowledge Articles and hundreds of Community platforms